BDBM50239183 CHEMBL4087824
SMILES O=C(c1c[nH]c2ccccc12)c1c[nH]c2ccccc12
InChI Key InChIKey=HYJTUULYIOBNLS-UHFFFAOYSA-N
Data  3 EC50
  Tab Delimited (TSV)   2D SDfile   Computed 3D by Vconf -m prep SDfile
Find this compound or compounds like it in BindingDB:
Activity Spreadsheet -- Enzyme Inhibition Constant Data from BindingDB
Found 3 hits for monomerid = 50239183
TargetG-protein coupled receptor 84(Homo sapiens (Human))
University Of Bonn
Curated by ChEMBL
LigandPNGBDBM50239183(CHEMBL4087824)
Affinity DataEC50:  553nM. Assay description: Agonist activity at Gi coupled human GPR84 expressed in CHO cells assessed as inhibition of forskolin-induced cAMP accumulation after 15 mins in pres...
In DepthDetails ArticlePubMed
TargetG-protein coupled receptor 84(Homo sapiens (Human))
University Of Bonn
Curated by ChEMBL
LigandPNGBDBM50239183(CHEMBL4087824)
Affinity DataEC50:  1.93E+3nM. Assay description: Positive allosteric modulation of recombinant human GPR84 expressed in CHO cell membranes co-expressing beta-arrestin2 assessed as increase in [3H]PS...
In DepthDetails ArticlePubMed
TargetG-protein coupled receptor 84(Homo sapiens (Human))
University Of Bonn
Curated by ChEMBL
LigandPNGBDBM50239183(CHEMBL4087824)
Affinity DataEC50:  1.90E+4nM. Assay description: Agonist activity at human GPR84 expressed in CHO cells assessed as beta-arrestin recruitment after 90 mins by beta-galactosidase complementation assa...
In DepthDetails ArticlePubMed