BDBM50239191 CHEMBL4062512
SMILES Fc1cccc2c(Cc3c[nH]c4c(F)cccc34)c[nH]c12
InChI Key InChIKey=USLWZUWMLIGQDV-UHFFFAOYSA-N
Data  3 EC50
  Tab Delimited (TSV)   2D SDfile   Computed 3D by Vconf -m prep SDfile
Find this compound or compounds like it in BindingDB:
Activity Spreadsheet -- Enzyme Inhibition Constant Data from BindingDB
Found 3 hits for monomerid = 50239191
TargetG-protein coupled receptor 84(Homo sapiens (Human))
University Of Bonn
Curated by ChEMBL
LigandPNGBDBM50239191(CHEMBL4062512)
Affinity DataEC50:  113nM. Assay description: Agonist activity at Gi coupled human GPR84 expressed in CHO cells assessed as inhibition of forskolin-induced cAMP accumulation after 15 mins in pres...
In DepthDetails ArticlePubMed
TargetG-protein coupled receptor 84(Homo sapiens (Human))
University Of Bonn
Curated by ChEMBL
LigandPNGBDBM50239191(CHEMBL4062512)
Affinity DataEC50:  62nM. Assay description: Positive allosteric modulation of recombinant human GPR84 expressed in CHO cell membranes co-expressing beta-arrestin2 assessed as increase in [3H]PS...
In DepthDetails ArticlePubMed
TargetG-protein coupled receptor 84(Homo sapiens (Human))
University Of Bonn
Curated by ChEMBL
LigandPNGBDBM50239191(CHEMBL4062512)
Affinity DataEC50:  6.07E+3nM. Assay description: Agonist activity at human GPR84 expressed in CHO cells assessed as beta-arrestin recruitment after 90 mins by beta-galactosidase complementation assa...
In DepthDetails ArticlePubMed