BDBM50239196 CHEMBL246504
SMILES Brc1ccc2[nH]cc(Cc3c[nH]c4ccc(Br)cc34)c2c1
InChI Key InChIKey=QUNVWKDXAHYQTO-UHFFFAOYSA-N
Data  2 EC50
  Tab Delimited (TSV)   2D SDfile   Computed 3D by Vconf -m prep SDfile
Find this compound or compounds like it in BindingDB:
Activity Spreadsheet -- Enzyme Inhibition Constant Data from BindingDB
Found 2 hits for monomerid = 50239196
TargetG-protein coupled receptor 84(Homo sapiens (Human))
University Of Bonn
Curated by ChEMBL
LigandPNGBDBM50239196(CHEMBL246504)
Affinity DataEC50:  59nM. Assay description: Positive allosteric modulation of recombinant human GPR84 expressed in CHO cell membranes co-expressing beta-arrestin2 assessed as increase in [3H]PS...
In DepthDetails ArticlePubMed
TargetG-protein coupled receptor 84(Homo sapiens (Human))
University Of Bonn
Curated by ChEMBL
LigandPNGBDBM50239196(CHEMBL246504)
Affinity DataEC50:  3.44E+3nM. Assay description: Agonist activity at Gi coupled human GPR84 expressed in CHO cells assessed as inhibition of forskolin-induced cAMP accumulation after 15 mins in pres...
In DepthDetails ArticlePubMed