BDBM50239198 CHEMBL4100764
SMILES COC(=O)c1ccc2[nH]cc(Cc3c[nH]c4ccc(cc34)C(=O)OC)c2c1
InChI Key InChIKey=BPLKUPGRQZBQAS-UHFFFAOYSA-N
Data  1 EC50
  Tab Delimited (TSV)   2D SDfile   Computed 3D by Vconf -m prep SDfile
Find this compound or compounds like it in BindingDB:
Activity Spreadsheet -- Enzyme Inhibition Constant Data from BindingDB
Found 1 hit for monomerid = 50239198
TargetG-protein coupled receptor 84(Homo sapiens (Human))
University Of Bonn
Curated by ChEMBL
LigandPNGBDBM50239198(CHEMBL4100764)
Affinity DataEC50: >1.00E+4nM. Assay description: Agonist activity at Gi coupled human GPR84 expressed in CHO cells assessed as inhibition of forskolin-induced cAMP accumulation after 15 mins in pres...
In DepthDetails ArticlePubMed