BDBM50239375 CHEBI:8890::Ropivacaine
SMILES CCCN1CCCC[C@H]1C(=O)Nc1c(C)cccc1C
InChI Key InChIKey=ZKMNUMMKYBVTFN-HNNXBMFYSA-N
Data  2 IC50
  Tab Delimited (TSV)   2D SDfile   Computed 3D by Vconf -m prep SDfile
Find this compound or compounds like it in BindingDB:
Activity Spreadsheet -- Enzyme Inhibition Constant Data from BindingDB
Found 2 hits for monomerid = 50239375
TargetPotassium channel subfamily K member 3(Homo sapiens (Human))
Universidad De Talca
Curated by ChEMBL
LigandPNGBDBM50239375(CHEBI:8890 | Ropivacaine)
Affinity DataIC50:  5.30E+4nM. Assay description: Inhibition of human TASK1 expressed in Xenopus oocytes by whole cell voltage clamp assay
In DepthDetails ArticlePubMed
TargetBile salt export pump(Homo sapiens (Human))
Astrazeneca
Curated by ChEMBL
LigandPNGBDBM50239375(CHEBI:8890 | Ropivacaine)
Affinity DataIC50:  6.46E+5nM. Assay description: Inhibition of human BSEP expressed in baculovirus transfected fall armyworm Sf21 cell membranes vesicles assessed as reduction in ATP-dependent [3H]-...
In DepthDetails ArticlePubMed