BDBM50239972 CHEBI:6794::Metaraminol
SMILES C[C@H](N)[C@H](O)c1cccc(O)c1
InChI Key InChIKey=WXFIGDLSSYIKKV-RCOVLWMOSA-N
Data  1 KI  2 IC50
  Tab Delimited (TSV)   2D SDfile   Computed 3D by Vconf -m prep SDfile
Find this compound or compounds like it in BindingDB:
Activity Spreadsheet -- Enzyme Inhibition Constant Data from BindingDB
Found 3 hits for monomerid = 50239972
TargetMacrophage migration inhibitory factor(Homo sapiens (Human))
Wuhan University
Curated by ChEMBL
LigandPNGBDBM50239972(CHEBI:6794 | Metaraminol)
Affinity DataKi:  7.71E+4nM. Assay description: Inhibition of MIF tautomerase (unknown origin) using 4-HPP as substrate preincubated for 1 hr followed by substrate addition by Lineweaver-Burk plot ...
In DepthDetails PubMed
TargetBile salt export pump(Homo sapiens (Human))
Astrazeneca
Curated by ChEMBL
LigandPNGBDBM50239972(CHEBI:6794 | Metaraminol)
Affinity DataIC50: >1.00E+6nM. Assay description: Inhibition of human BSEP expressed in baculovirus transfected fall armyworm Sf21 cell membranes vesicles assessed as reduction in ATP-dependent [3H]-...
In DepthDetails ArticlePubMed
TargetMacrophage migration inhibitory factor(Homo sapiens (Human))
Wuhan University
Curated by ChEMBL
LigandPNGBDBM50239972(CHEBI:6794 | Metaraminol)
Affinity DataIC50:  9.81E+4nM. Assay description: Inhibition of MIF tautomerase (unknown origin) using 4-HPP as substrate preincubated for 1 hr followed by substrate addition
In DepthDetails PubMed