BDBM50239982 CHEBI:17486::Hyoscyamine
SMILES [H][C@]12CC[C@]([H])(C[C@@H](C1)OC(=O)[C@H](CO)c1ccccc1)N2C
InChI Key InChIKey=RKUNBYITZUJHSG-FXUDXRNXSA-N
Data  1 IC50
PDB links: 6 PDB IDs match this monomer.
  Tab Delimited (TSV)   2D SDfile   Computed 3D by Vconf -m prep SDfile
Find this compound or compounds like it in BindingDB:
Activity Spreadsheet -- Enzyme Inhibition Constant Data from BindingDB
Found 1 hit for monomerid = 50239982
TargetBile salt export pump(Homo sapiens (Human))
Astrazeneca
Curated by ChEMBL
LigandPNGBDBM50239982(CHEBI:17486 | Hyoscyamine)
Affinity DataIC50: >1.00E+6nM. Assay description: Inhibition of human BSEP expressed in baculovirus transfected fall armyworm Sf21 cell membranes vesicles assessed as reduction in ATP-dependent [3H]-...
In DepthDetails ArticlePubMed