BDBM50240030 Acetanilide::Antifebrin::CHEBI:28884
SMILES CC(=O)Nc1ccccc1
InChI Key InChIKey=FZERHIULMFGESH-UHFFFAOYSA-N
Data  2 IC50
  Tab Delimited (TSV)   2D SDfile   Computed 3D by Vconf -m prep SDfile
Find this compound or compounds like it in BindingDB:
Activity Spreadsheet -- Enzyme Inhibition Constant Data from BindingDB
Found 2 hits for monomerid = 50240030
TargetPolyphenol oxidase 2(Agaricus bisporus (Common mushroom))
Kyungpook National University
Curated by ChEMBL
LigandPNGBDBM50240030(Acetanilide | Antifebrin | CHEBI:28884)
Affinity DataIC50: >1.00E+6nM. Assay description: Inhibition of mushroom tyrosinase using L-tyrosine as substrate
In DepthDetails ArticlePubMed
TargetBile salt export pump(Homo sapiens (Human))
Astrazeneca
Curated by ChEMBL
LigandPNGBDBM50240030(Acetanilide | Antifebrin | CHEBI:28884)
Affinity DataIC50: >1.00E+6nM. Assay description: Inhibition of human BSEP expressed in baculovirus transfected fall armyworm Sf21 cell membranes vesicles assessed as reduction in ATP-dependent [3H]-...
In DepthDetails ArticlePubMed