BDBM50240099 CHEBI:9613::Tolazamide::Tolinase::U-17835
SMILES Cc1ccc(cc1)S(=O)(=O)NC(=O)NN1CCCCCC1
InChI Key InChIKey=OUDSBRTVNLOZBN-UHFFFAOYSA-N
Data  1 KI  1 IC50
  Tab Delimited (TSV)   2D SDfile   Computed 3D by Vconf -m prep SDfile
Find this compound or compounds like it in BindingDB:
Activity Spreadsheet -- Enzyme Inhibition Constant Data from BindingDB
Found 2 hits for monomerid = 50240099
TargetAlbumin(Homo sapiens (Human))
Molecular Discovery
Curated by ChEMBL
LigandPNGBDBM50240099(CHEBI:9613 | Tolazamide | Tolinase | U-17835)
Affinity DataKi:  5.37E+4nM. Assay description: Binding affinity towards human serum albumin
In DepthDetails ArticlePubMed
TargetBile salt export pump(Homo sapiens (Human))
Astrazeneca
Curated by ChEMBL
LigandPNGBDBM50240099(CHEBI:9613 | Tolazamide | Tolinase | U-17835)
Affinity DataIC50:  2.86E+5nM. Assay description: Inhibition of human BSEP expressed in baculovirus transfected fall armyworm Sf21 cell membranes vesicles assessed as reduction in ATP-dependent [3H]-...
In DepthDetails ArticlePubMed