BDBM50241203 CHEMBL414357::HGEGTFTSDLSKQMEEEAVRLFIEWLKNGGPSSGSPPPS-NH2::exenatide::exendin-4
SMILES [H][C@](NC(=O)CNC(=O)[C@H](CCC(O)=O)NC(=O)CNC(=O)[C@@H](N)Cc1cnc[nH]1)([C@@H](C)O)C(=O)N[C@@H](Cc1ccccc1)C(=O)N[C@@]([H])([C@@H](C)O)C(=O)N[C@@H](CO)C(=O)N[C@@H](CC(O)=O)C(=O)N[C@@H](CC(C)C)C(=O)N[C@@H](CO)C(=O)N[C@@H](CCCCN)C(=O)N[C@@H](CCC(N)=O)C(=O)N[C@@H](CCSC)C(=O)N[C@@H](CCC(O)=O)C(=O)N[C@@H](CCC(O)=O)C(=O)N[C@@H](CCC(O)=O)C(=O)N[C@@H](C)C(=O)N[C@@H](C(C)C)C(=O)N[C@@H](CCCNC(N)=N)C(=O)N[C@@H](CC(C)C)C(=O)N[C@@H](Cc1ccccc1)C(=O)N[C@@]([H])([C@@H](C)CC)C(=O)N[C@@H](CCC(O)=O)C(=O)N[C@@H](Cc1c[nH]c2ccccc12)C(=O)N[C@@H](CC(C)C)C(=O)N[C@@H](CCCCN)C(=O)N[C@@H](CC(N)=O)C(=O)NCC(=O)NCC(=O)N1CCC[C@@]1([H])C(=O)N[C@@H](CO)C(=O)N[C@@H](CO)C(=O)NCC(=O)N[C@@H](C)C(=O)N1CCC[C@@]1([H])C(=O)N1CCC[C@@]1([H])C(=O)N1CCC[C@@]1([H])C(=O)N[C@@H](CO)C(N)=O
InChI Key InChIKey=HTQBXNHDCUEHJF-XWLPCZSASA-N
Data  2 KI  4 IC50  22 EC50
  Tab Delimited (TSV)   2D SDfile   Computed 3D by Vconf -m prep SDfile
Find this compound or compounds like it in BindingDB:
Activity Spreadsheet -- Enzyme Inhibition Constant Data from BindingDB
Found 7 hits for monomerid = 50241203
TargetGastric inhibitory polypeptide receptor(Homo sapiens (Human))
Sanofi-Aventis Deutschland
Curated by ChEMBL
LigandPNGBDBM50241203(CHEMBL414357 | HGEGTFTSDLSKQMEEEAVRLFIEWLKNGGPSSGS...)
Affinity DataEC50:  200nM. Assay description: Agonist activity at human GIP receptor expressed in HEK293 cells assessed as cAMP accumulation after 30 mins by HTRF assay
In DepthDetails ArticlePubMed
TargetGlucagon-like peptide 1 receptor(Homo sapiens (Human))
Sanofi-Aventis Deutschland
Curated by ChEMBL
LigandPNGBDBM50241203(CHEMBL414357 | HGEGTFTSDLSKQMEEEAVRLFIEWLKNGGPSSGS...)
Affinity DataEC50:  0.000400nM. Assay description: Agonist activity at human GLP1R expressed in HEK293 cells assessed as cAMP accumulation after 30 mins by HTRF assay
In DepthDetails ArticlePubMed
TargetGlucagon receptor(Homo sapiens (Human))
Sanofi-Aventis Deutschland
Curated by ChEMBL
LigandPNGBDBM50241203(CHEMBL414357 | HGEGTFTSDLSKQMEEEAVRLFIEWLKNGGPSSGS...)
Affinity DataEC50: >1.00E+5nM. Assay description: Agonist activity at human glucagon receptor expressed in HEK293 cells assessed as cAMP accumulation after 30 mins by HTRF assay
In DepthDetails ArticlePubMed
TargetGlucagon-like peptide 1 receptor(Homo sapiens (Human))
Sanofi-Aventis Deutschland
Curated by ChEMBL
LigandPNGBDBM50241203(CHEMBL414357 | HGEGTFTSDLSKQMEEEAVRLFIEWLKNGGPSSGS...)
Affinity DataEC50:  0.000400nM. Assay description: Agonist activity at human GLP-1 receptor expressed in HEK293 cells assessed as cAMP accumulation after 30 mins by HTRF assay
In DepthDetails ArticlePubMed
TargetGlucagon receptor(Mus musculus)
Sanofi-Aventis Deutschland
Curated by ChEMBL
LigandPNGBDBM50241203(CHEMBL414357 | HGEGTFTSDLSKQMEEEAVRLFIEWLKNGGPSSGS...)
Affinity DataEC50: >1.00E+4nM. Assay description: Agonist activity at mouse glucagon receptor expressed in HEK293 cells assessed as cAMP accumulation after 30 mins by HTRF assay
In DepthDetails ArticlePubMed
TargetGlucagon-like peptide 1 receptor(Mus musculus)
Sanofi-Aventis Deutschland
Curated by ChEMBL
LigandPNGBDBM50241203(CHEMBL414357 | HGEGTFTSDLSKQMEEEAVRLFIEWLKNGGPSSGS...)
Affinity DataEC50:  0.000500nM. Assay description: Agonist activity at mouse GLP-1 receptor expressed in HEK293 cells assessed as cAMP accumulation after 30 mins by HTRF assay
In DepthDetails ArticlePubMed
TargetGlucagon receptor(Homo sapiens (Human))
Sanofi-Aventis Deutschland
Curated by ChEMBL
LigandPNGBDBM50241203(CHEMBL414357 | HGEGTFTSDLSKQMEEEAVRLFIEWLKNGGPSSGS...)
Affinity DataEC50: >1.00E+5nM. Assay description: Agonist activity at human glucagon receptor expressed in HEK293 cells assessed as cAMP accumulation after 30 mins by HTRF assay
In DepthDetails ArticlePubMed