BDBM50244069 CHEMBL4089313
SMILES COc1cccc(F)c1N1CCC(CC1)Oc1ccc(cc1)N1N=C([C@@H](C)[C@@H]1CC(O)=O)C(F)(F)F
InChI Key InChIKey=CBIPLAHSXILPHJ-YWZLYKJASA-N
Data  1 EC50
  Tab Delimited (TSV)   2D SDfile   Computed 3D by Vconf -m prep SDfile
Find this compound or compounds like it in BindingDB:
Activity Spreadsheet -- Enzyme Inhibition Constant Data from BindingDB
Found 1 hit for monomerid = 50244069
TargetFree fatty acid receptor 1(Homo sapiens (Human))
Bristol-Myers Squibb
Curated by ChEMBL
LigandPNGBDBM50244069(CHEMBL4089313)
Affinity DataEC50:  5.90E+3nM. Assay description: Agonist activity at human GPR40 expressed in CHOA12 cells assessed as induction of Ca2+ mobilization by FLIPR assay
In DepthDetails ArticlePubMed