BDBM50244603 CHEMBL454102::rac-(E/Z)-(4-(3-bromo-4-fluorobenzylidene)-2-(hydroxymethyl)-5-oxo-tetrahydrofuran-2-yl)methyl pivalate
SMILES CC(C)(C)C(=O)OCC1(CO)C\C(=C\c2ccc(F)c(Br)c2)C(=O)O1
InChI Key InChIKey=GXMVULFRKJINSE-SDQBBNPISA-N
Data  1 KI
  Tab Delimited (TSV)   2D SDfile   Computed 3D by Vconf -m prep SDfile
Find this compound or compounds like it in BindingDB:
Activity Spreadsheet -- Enzyme Inhibition Constant Data from BindingDB
Found 1 hit for monomerid = 50244603
TargetProtein kinase C alpha type(MOUSE)
National Cancer Institute-Frederick
Curated by ChEMBL
LigandPNGBDBM50244603(CHEMBL454102 | rac-(E/Z)-(4-(3-bromo-4-fluorobenzy...)
Affinity DataKi:  19.3nM. Assay description: Displacement of [3H]PDBu form mouse PKCalpha by scintillation counting
In DepthDetails ArticlePubMed