BDBM50244748 (S)-2-(2-chloro-5-((3-(4-chlorophenoxy)-6-fluoro-2-methyl-1H-pyrrolo[2,3-b]pyridin-1-yl)methyl)phenoxy)propanoic acid::CHEMBL518499
SMILES C[C@H](Oc1cc(Cn2c(C)c(Oc3ccc(Cl)cc3)c3ccc(F)nc23)ccc1Cl)C(O)=O
InChI Key InChIKey=UCHITAGTDQJGJR-AWEZNQCLSA-N
Data  3 IC50  1 EC50
  Tab Delimited (TSV)   2D SDfile   Computed 3D by Vconf -m prep SDfile
Find this compound or compounds like it in BindingDB:
Activity Spreadsheet -- Enzyme Inhibition Constant Data from BindingDB
Found 4 hits for monomerid = 50244748
TargetPeroxisome proliferator-activated receptor gamma(Homo sapiens (Human))
Merck Research Laboratories
Curated by ChEMBL
LigandPNGBDBM50244748((S)-2-(2-chloro-5-((3-(4-chlorophenoxy)-6-fluoro-2...)
Affinity DataEC50:  4nM. Assay description: Agonist activity at human PPARgamma receptor expressed in african green monkey COS cells after 48 hrs by GAL4 transactivation assay
In DepthDetails ArticlePubMed
TargetPeroxisome proliferator-activated receptor delta(Homo sapiens (Human))
Merck Research Laboratories
Curated by ChEMBL
LigandPNGBDBM50244748((S)-2-(2-chloro-5-((3-(4-chlorophenoxy)-6-fluoro-2...)
Affinity DataIC50: >5.00E+4nM. Assay description: Binding affinity to PPARdelta
In DepthDetails ArticlePubMed
TargetPeroxisome proliferator-activated receptor alpha(Homo sapiens (Human))
Merck Research Laboratories
Curated by ChEMBL
LigandPNGBDBM50244748((S)-2-(2-chloro-5-((3-(4-chlorophenoxy)-6-fluoro-2...)
Affinity DataIC50: >5.00E+4nM. Assay description: Binding affinity to human PPARalpha
In DepthDetails ArticlePubMed
TargetPeroxisome proliferator-activated receptor gamma(Homo sapiens (Human))
Merck Research Laboratories
Curated by ChEMBL
LigandPNGBDBM50244748((S)-2-(2-chloro-5-((3-(4-chlorophenoxy)-6-fluoro-2...)
Affinity DataIC50:  3nM. Assay description: Displacement of [3H]2AD-5075 from GST-tagged human PPARgamma receptor expressed in Escherichia coli BL21
In DepthDetails ArticlePubMed