BDBM50244972 CHEMBL472356::rac-(E/Z)-(4-(2-ethylhexylidene)-2-(hydroxymethyl)-5-oxo-tetrahydrofuran-2-yl)methyl 4-(dimethylamino)benzoate::rac-(Z)-[4-(2-Ethylhexylidene)-2-(hydroxymethyl)-5-oxo-2-2,3-dihydrofuryl]methyl4-(dimethylamino)benzoate
SMILES CCCCC(CC)\C=C1\CC(CO)(COC(=O)c2ccc(cc2)N(C)C)OC1=O
InChI Key InChIKey=JMKDPOCHTLWPTO-UYRXBGFRSA-N
Data  2 KI
  Tab Delimited (TSV)   2D SDfile   Computed 3D by Vconf -m prep SDfile
Find this compound or compounds like it in BindingDB:
Activity Spreadsheet -- Enzyme Inhibition Constant Data from BindingDB
Found 2 hits for monomerid = 50244972
TargetProtein kinase C alpha type(MOUSE)
National Cancer Institute-Frederick
Curated by ChEMBL
LigandPNGBDBM50244972(CHEMBL472356 | rac-(E/Z)-(4-(2-ethylhexylidene)-2-...)
Affinity DataKi:  133nM. Assay description: Displacement of [3H]PDBu form mouse PKCalpha by scintillation counting
In DepthDetails ArticlePubMed
TargetProtein kinase C alpha type(MOUSE)
National Cancer Institute-Frederick
Curated by ChEMBL
LigandPNGBDBM50244972(CHEMBL472356 | rac-(E/Z)-(4-(2-ethylhexylidene)-2-...)
Affinity DataKi:  134nM. Assay description: Displacement of [3H]PDBu form mouse PKCalpha by scintillation counting
In DepthDetails ArticlePubMed