BDBM50245081 CHEMBL487841::rac-(E/Z)-(4-(cyclohexylmethylene)-2-(hydroxymethyl)-5-oxo-tetrahydrofuran-2-yl)methyl 4-(dimethylamino)benzoate
SMILES CN(C)c1ccc(cc1)C(=O)OCC1(CO)C\C(=C\C2CCCCC2)C(=O)O1
InChI Key InChIKey=UHXBXJPUNYNCPB-PDGQHHTCSA-N
Data  1 KI
  Tab Delimited (TSV)   2D SDfile   Computed 3D by Vconf -m prep SDfile
Find this compound or compounds like it in BindingDB:
Activity Spreadsheet -- Enzyme Inhibition Constant Data from BindingDB
Found 1 hit for monomerid = 50245081
TargetProtein kinase C alpha type(MOUSE)
National Cancer Institute-Frederick
Curated by ChEMBL
LigandPNGBDBM50245081(CHEMBL487841 | rac-(E/Z)-(4-(cyclohexylmethylene)-...)
Affinity DataKi:  305nM. Assay description: Displacement of [3H]PDBu form mouse PKCalpha by scintillation counting
In DepthDetails ArticlePubMed