BDBM50245158 2-(piperidin-1-yl)-8-(5-(thiophen-2-yl)thiazol-2-yl)-4H-chromen-4-one::CHEMBL454659
SMILES O=c1cc(oc2c(cccc12)-c1ncc(s1)-c1cccs1)N1CCCCC1
InChI Key InChIKey=XJNUXAOYAYFPPK-UHFFFAOYSA-N
Data  1 IC50
  Tab Delimited (TSV)   2D SDfile   Computed 3D by Vconf -m prep SDfile
Find this compound or compounds like it in BindingDB:
Activity Spreadsheet -- Enzyme Inhibition Constant Data from BindingDB
Found 1 hit for monomerid = 50245158
TargetDNA-dependent protein kinase catalytic subunit(Homo sapiens (Human))
Newcastle University
Curated by ChEMBL
LigandPNGBDBM50245158(2-(piperidin-1-yl)-8-(5-(thiophen-2-yl)thiazol-2-y...)
Affinity DataIC50:  480nM. Assay description: Inhibition of DNA-dependent protein kinase
In DepthDetails ArticlePubMed