BDBM50245505 8-(4'-hydroxybiphenyl-3-yl)-2-morpholino-4H-chromen-4-one::CHEMBL471335
SMILES Oc1ccc(cc1)-c1cccc(c1)-c1cccc2c1oc(cc2=O)N1CCOCC1
InChI Key InChIKey=LFVJSQFZNFWOIW-UHFFFAOYSA-N
Data  1 IC50
  Tab Delimited (TSV)   2D SDfile   Computed 3D by Vconf -m prep SDfile
Find this compound or compounds like it in BindingDB:
Activity Spreadsheet -- Enzyme Inhibition Constant Data from BindingDB
Found 1 hit for monomerid = 50245505
TargetDNA-dependent protein kinase catalytic subunit(Homo sapiens (Human))
Newcastle University
Curated by ChEMBL
LigandPNGBDBM50245505(8-(4'-hydroxybiphenyl-3-yl)-2-morpholino-4H-chrome...)
Affinity DataIC50:  140nM. Assay description: Inhibition of DNA-dependent protein kinase
In DepthDetails ArticlePubMed