BDBM50245593 8-(3-(5-methylthiophen-3-yl)phenyl)-2-morpholino-4H-chromen-4-one::CHEMBL488212
SMILES Cc1cc(cs1)-c1cccc(c1)-c1cccc2c1oc(cc2=O)N1CCOCC1
InChI Key InChIKey=AVOYVKPTDLXTLX-UHFFFAOYSA-N
Data  1 IC50
  Tab Delimited (TSV)   2D SDfile   Computed 3D by Vconf -m prep SDfile
Find this compound or compounds like it in BindingDB:
Activity Spreadsheet -- Enzyme Inhibition Constant Data from BindingDB
Found 1 hit for monomerid = 50245593
TargetDNA-dependent protein kinase catalytic subunit(Homo sapiens (Human))
Newcastle University
Curated by ChEMBL
LigandPNGBDBM50245593(8-(3-(5-methylthiophen-3-yl)phenyl)-2-morpholino-4...)
Affinity DataIC50:  1.13E+3nM. Assay description: Inhibition of DNA-dependent protein kinase
In DepthDetails ArticlePubMed