BDBM50245712 2-morpholino-8-(3-(pyrimidin-5-yl)phenyl)-4H-chromen-4-one::CHEMBL453889
SMILES O=c1cc(oc2c(cccc12)-c1cccc(c1)-c1cncnc1)N1CCOCC1
InChI Key InChIKey=IQJAFXZUJLSTMN-UHFFFAOYSA-N
Data  1 IC50
  Tab Delimited (TSV)   2D SDfile   Computed 3D by Vconf -m prep SDfile
Find this compound or compounds like it in BindingDB:
Activity Spreadsheet -- Enzyme Inhibition Constant Data from BindingDB
Found 1 hit for monomerid = 50245712
TargetDNA-dependent protein kinase catalytic subunit(Homo sapiens (Human))
Newcastle University
Curated by ChEMBL
LigandPNGBDBM50245712(2-morpholino-8-(3-(pyrimidin-5-yl)phenyl)-4H-chrom...)
Affinity DataIC50:  1.57E+3nM. Assay description: Inhibition of DNA-dependent protein kinase
In DepthDetails ArticlePubMed