BDBM50245748 CHEMBL4079984
SMILES NS(=O)(=O)c1cccc(c1)-n1c(S)nc2cc(Cl)ccc2c1=O
InChI Key InChIKey=JWOADCBBHDAQNA-UHFFFAOYSA-N
Data  4 KI
  Tab Delimited (TSV)   2D SDfile   Computed 3D by Vconf -m prep SDfile
Find this compound or compounds like it in BindingDB:
Activity Spreadsheet -- Enzyme Inhibition Constant Data from BindingDB
Found 4 hits for monomerid = 50245748
TargetCarbonic anhydrase 2(Homo sapiens (Human))
Universit£
Curated by ChEMBL
LigandPNGBDBM50245748(CHEMBL4079984)
Affinity DataKi:  0.980nM. Assay description: Inhibition of recombinant human carbonic anhydrase 2 incubated for 15 mins prior to testing by stopped flow CO2 hydration assay
In DepthDetails ArticlePubMed
TargetCarbonic anhydrase 12(Homo sapiens (Human))
Universit£
Curated by ChEMBL
LigandPNGBDBM50245748(CHEMBL4079984)
Affinity DataKi:  5.80nM. Assay description: Inhibition of recombinant human carbonic anhydrase 12 incubated for 15 mins prior to testing by stopped flow CO2 hydration assay
In DepthDetails ArticlePubMed
TargetCarbonic anhydrase 9(Homo sapiens (Human))
Universit£
Curated by ChEMBL
LigandPNGBDBM50245748(CHEMBL4079984)
Affinity DataKi:  15nM. Assay description: Inhibition of recombinant human carbonic anhydrase 9 incubated for 15 mins prior to testing by stopped flow CO2 hydration assay
In DepthDetails ArticlePubMed
TargetCarbonic anhydrase 1(Homo sapiens (Human))
Universit£
Curated by ChEMBL
LigandPNGBDBM50245748(CHEMBL4079984)
Affinity DataKi:  164nM. Assay description: Inhibition of recombinant human carbonic anhydrase 1 incubated for 15 mins prior to testing by stopped flow CO2 hydration assay
In DepthDetails ArticlePubMed