BDBM50245753 8-(3,3'-bithiophen-5-yl)-2-(piperidin-1-yl)-4H-chromen-4-one::CHEMBL508479
SMILES O=c1cc(oc2c(cccc12)-c1cc(cs1)-c1ccsc1)N1CCCCC1
InChI Key InChIKey=CMZNIJIDMQOYMW-UHFFFAOYSA-N
Data  1 IC50
  Tab Delimited (TSV)   2D SDfile   Computed 3D by Vconf -m prep SDfile
Find this compound or compounds like it in BindingDB:
Activity Spreadsheet -- Enzyme Inhibition Constant Data from BindingDB
Found 1 hit for monomerid = 50245753
TargetDNA-dependent protein kinase catalytic subunit(Homo sapiens (Human))
Newcastle University
Curated by ChEMBL
LigandPNGBDBM50245753(8-(3,3'-bithiophen-5-yl)-2-(piperidin-1-yl)-4H-chr...)
Affinity DataIC50:  90nM. Assay description: Inhibition of DNA-dependent protein kinase
In DepthDetails ArticlePubMed