BDBM50245754 8-(5-(naphthalen-1-yl)thiophen-2-yl)-2-(piperidin-1-yl)-4H-chromen-4-one::CHEMBL453883
SMILES O=c1cc(oc2c(cccc12)-c1ccc(s1)-c1cccc2ccccc12)N1CCCCC1
InChI Key InChIKey=AFMDBHXAIWUHSA-UHFFFAOYSA-N
Data  1 IC50
  Tab Delimited (TSV)   2D SDfile   Computed 3D by Vconf -m prep SDfile
Find this compound or compounds like it in BindingDB:
Activity Spreadsheet -- Enzyme Inhibition Constant Data from BindingDB
Found 1 hit for monomerid = 50245754
TargetDNA-dependent protein kinase catalytic subunit(Homo sapiens (Human))
Newcastle University
Curated by ChEMBL
LigandPNGBDBM50245754(8-(5-(naphthalen-1-yl)thiophen-2-yl)-2-(piperidin-...)
Affinity DataIC50:  2.46E+3nM. Assay description: Inhibition of DNA-dependent protein kinase
In DepthDetails ArticlePubMed