BDBM50245844 CHEMBL4098891
SMILES Oc1ccc2ccccc2c1C(N1CCCC1=O)c1ccc(Cl)cc1
InChI Key InChIKey=YZIPFPWVMOXRRR-UHFFFAOYSA-N
Data  1 IC50
  Tab Delimited (TSV)   2D SDfile   Computed 3D by Vconf -m prep SDfile
Find this compound or compounds like it in BindingDB:
Activity Spreadsheet -- Enzyme Inhibition Constant Data from BindingDB
Found 1 hit for monomerid = 50245844
LigandPNGBDBM50245844(CHEMBL4098891)
Affinity DataIC50: <2.50E+4nM. Assay description: Inhibition of PI3K p110alpha (unknown origin) using PIP2 as substrate preincubated for 10 mins followed by substrate addition measured after 1 hr
In DepthDetails ArticlePubMed