BDBM50246932 CHEMBL4073864::US10570121, Example 112
SMILES COC(C1CCN(CC1)C(=O)CO)c1cc(Cl)c2CCN(Cc3c(OC)cc(C)[nH]c3=O)C(=O)c2c1Cl
InChI Key InChIKey=AARGZKBSIZRPJQ-UHFFFAOYSA-N
Data  2 KI  4 IC50
  Tab Delimited (TSV)   2D SDfile   Computed 3D by Vconf -m prep SDfile
Find this compound or compounds like it in BindingDB:
Activity Spreadsheet -- Enzyme Inhibition Constant Data from BindingDB
Found 6 hits for monomerid = 50246932
TargetHistone-lysine N-methyltransferase EZH2(Homo sapiens (Human))
Pfizer
US Patent
LigandPNGBDBM50246932(CHEMBL4073864 | US10570121, Example 112)
Affinity DataKi:  0.0200nM. Assay description: A. Compound preparation1. Prepare 10 mM stock solutions in 100% DMSO from solid material2. Serial dilute 10 mM compound stocks either 2 or 3-fold in ...
In DepthDetails US Patent
TargetHistone-lysine N-methyltransferase EZH2(Homo sapiens (Human))
Pfizer
US Patent
LigandPNGBDBM50246932(CHEMBL4073864 | US10570121, Example 112)
Affinity DataKi:  21nM. Assay description: A. Compound preparation1. Prepare 10 mM stock solutions in 100% DMSO from solid material2. Serial dilute 10 mM compound stocks either 2 or 3-fold in ...
In DepthDetails US Patent
TargetHistone-lysine N-methyltransferase EZH2(Homo sapiens (Human))
Pfizer
US Patent
LigandPNGBDBM50246932(CHEMBL4073864 | US10570121, Example 112)
Affinity DataIC50:  231nM. Assay description: Inhibition of EZH2 in human KARPAS422 cells assessed as reduction in H3K27me3 level after 72 hrs by ELISA
In DepthDetails ArticlePubMed
TargetHistone-lysine N-methyltransferase EZH2 [2-746,Y641N](Homo sapiens (Human))
Pfizer
US Patent
LigandPNGBDBM50246932(CHEMBL4073864 | US10570121, Example 112)
Affinity DataIC50:  125nM. Assay description: A. Compound preparation1. Prepare 10 mM stock solutions in 100% DMSO from solid material2. Serial dilute 10 mM compound stocks either 2 or 3-fold in ...
In DepthDetails US Patent
TargetHistone-lysine N-methyltransferase EZH2 [2-746,Y641N](Homo sapiens (Human))
Pfizer
US Patent
LigandPNGBDBM50246932(CHEMBL4073864 | US10570121, Example 112)
Affinity DataIC50:  1nM. Assay description: A. Compound preparation1. Prepare 10 mM stock solutions in 100% DMSO from solid material2. Serial dilute 10 mM compound stocks either 2 or 3-fold in ...
In DepthDetails US Patent
TargetHistone-lysine N-methyltransferase EZH2(Homo sapiens (Human))
Pfizer
US Patent
LigandPNGBDBM50246932(CHEMBL4073864 | US10570121, Example 112)
Affinity DataIC50:  231nM. Assay description: Inhibition of EZH2 in human KARPAS422 cells assessed as reduction in H3K27me3 level after 72 hrs by ELISA
In DepthDetails ArticlePubMed