BDBM50248544 (S)-3-(3,4-dioxo-2-(2,2,2-trifluoro-1-phenylethylamino)cyclobut-1-enylamino)-2-hydroxy-N,N-dimethylbenzamide::CHEMBL464301
SMILES CN(C)C(=O)c1cccc(Nc2c(N[C@@H](c3ccccc3)C(F)(F)F)c(=O)c2=O)c1O
InChI Key InChIKey=IPLGVPPLWIAZSG-IBGZPJMESA-N
Data  2 KI
  Tab Delimited (TSV)   2D SDfile   Computed 3D by Vconf -m prep SDfile
Find this compound or compounds like it in BindingDB:
Activity Spreadsheet -- Enzyme Inhibition Constant Data from BindingDB
Found 2 hits for monomerid = 50248544
TargetC-X-C chemokine receptor type 2(Homo sapiens (Human))
Schering-Plough Research Institute
Curated by ChEMBL
LigandPNGBDBM50248544((S)-3-(3,4-dioxo-2-(2,2,2-trifluoro-1-phenylethyla...)
Affinity DataKi:  14nM. Assay description: Binding affinity to CXCR2 (unknown origin)
In DepthDetails ArticlePubMed
TargetC-X-C chemokine receptor type 1(Homo sapiens (Human))
Schering-Plough Research Institute
Curated by ChEMBL
LigandPNGBDBM50248544((S)-3-(3,4-dioxo-2-(2,2,2-trifluoro-1-phenylethyla...)
Affinity DataKi:  40nM. Assay description: Binding affinity to CXCR1 (unknown origin)
In DepthDetails ArticlePubMed