BDBM50249171 (4-(1H-benzo[d]imidazol-2-yl)piperidin-1-yl)(4-(pyridin-4-yl)phenyl)methanone::CHEMBL472790
SMILES O=C(N1CCC(CC1)c1nc2ccccc2[nH]1)c1ccc(cc1)-c1ccncc1
InChI Key InChIKey=STIWCUJQAFZHQE-UHFFFAOYSA-N
Data  2 IC50
  Tab Delimited (TSV)   2D SDfile   Computed 3D by Vconf -m prep SDfile
Find this compound or compounds like it in BindingDB:
Activity Spreadsheet -- Enzyme Inhibition Constant Data from BindingDB
Found 2 hits for monomerid = 50249171
Target5-hydroxytryptamine receptor 2B(Homo sapiens (Human))
Boehringer Ingelheim Pharmaceuticals
Curated by ChEMBL
LigandPNGBDBM50249171((4-(1H-benzo[d]imidazol-2-yl)piperidin-1-yl)(4-(py...)
Affinity DataIC50: >1.30E+3nM. Assay description: Antagonist activity at 5-HT2B receptor (unknown origin) expressed in CHOK1 cells assessed as inhibition of serotonin-induced intracellular Ca2+ flux ...
In DepthDetails ArticlePubMed
Target5-hydroxytryptamine receptor 2B(Homo sapiens (Human))
Boehringer Ingelheim Pharmaceuticals
Curated by ChEMBL
LigandPNGBDBM50249171((4-(1H-benzo[d]imidazol-2-yl)piperidin-1-yl)(4-(py...)
Affinity DataIC50: >1.30E+4nM. Assay description: Antagonist activity at 5-HT2B receptor (unknown origin) expressed in CHOK1 cells assessed as inhibition of serotonin-induced intracellular Ca2+ flux ...
In DepthDetails ArticlePubMed