BDBM50249174 (4-(1H-benzo[d]imidazol-2-yl)piperidin-1-yl)(4-(pyrimidin-2-yl)phenyl)methanone::CHEMBL472986
SMILES O=C(N1CCC(CC1)c1nc2ccccc2[nH]1)c1ccc(cc1)-c1ncccn1
InChI Key InChIKey=UCMOHPZCFZTGOA-UHFFFAOYSA-N
Data  2 IC50
  Tab Delimited (TSV)   2D SDfile   Computed 3D by Vconf -m prep SDfile
Find this compound or compounds like it in BindingDB:
Activity Spreadsheet -- Enzyme Inhibition Constant Data from BindingDB
Found 2 hits for monomerid = 50249174
Target5-hydroxytryptamine receptor 2B(Homo sapiens (Human))
Boehringer Ingelheim Pharmaceuticals
Curated by ChEMBL
LigandPNGBDBM50249174((4-(1H-benzo[d]imidazol-2-yl)piperidin-1-yl)(4-(py...)
Affinity DataIC50:  120nM. Assay description: Antagonist activity at 5-HT2B receptor (unknown origin) expressed in CHOK1 cells assessed as inhibition of serotonin-induced intracellular Ca2+ flux ...
In DepthDetails ArticlePubMed
Target5-hydroxytryptamine receptor 2B(Homo sapiens (Human))
Boehringer Ingelheim Pharmaceuticals
Curated by ChEMBL
LigandPNGBDBM50249174((4-(1H-benzo[d]imidazol-2-yl)piperidin-1-yl)(4-(py...)
Affinity DataIC50: >2.70E+3nM. Assay description: Antagonist activity at 5-HT2B receptor (unknown origin) expressed in CHOK1 cells assessed as inhibition of serotonin-induced intracellular Ca2+ flux ...
In DepthDetails ArticlePubMed