BDBM50249442 CHEMBL4097819
SMILES Cc1nnc2sc(C(=O)NCc3ccc(cc3)-c3cccnc3)c(N)c2c1C
InChI Key InChIKey=ZITQIRVMKWVRQP-UHFFFAOYSA-N
Data  2 EC50
  Tab Delimited (TSV)   2D SDfile   Computed 3D by Vconf -m prep SDfile
Find this compound or compounds like it in BindingDB:
Activity Spreadsheet -- Enzyme Inhibition Constant Data from BindingDB
Found 2 hits for monomerid = 50249442
TargetMuscarinic acetylcholine receptor M4(Homo sapiens (Human))
Vanderbilt University Medical Center
Curated by ChEMBL
LigandPNGBDBM50249442(CHEMBL4097819)
Affinity DataEC50:  63nM. Assay description: Positive allosteric modulation of human M4 receptor expressed in CHO cells coexpressing Gqi5 assessed as increase in acetylcholine-induced calcium mo...
In DepthDetails ArticlePubMed
TargetMuscarinic acetylcholine receptor M4(Homo sapiens (Human))
Vanderbilt University Medical Center
Curated by ChEMBL
LigandPNGBDBM50249442(CHEMBL4097819)
Affinity DataEC50:  63.1nM. Assay description: Positive allosteric modulation of human M4 receptor expressed in CHO cells coexpressing Gqi5 assessed as increase in acetylcholine-induced calcium mo...
In DepthDetails ArticlePubMed