BDBM50250549 CHEMBL4092312
SMILES Cc1cc(O)nc(C[S+]([O-])C(c2ccccc2)c2ccccc2)n1
InChI Key InChIKey=ZYSWIJDLMFVJDT-UHFFFAOYSA-N
Data  1 IC50
  Tab Delimited (TSV)   2D SDfile   Computed 3D by Vconf -m prep SDfile
Find this compound or compounds like it in BindingDB:
Activity Spreadsheet -- Enzyme Inhibition Constant Data from BindingDB
Found 1 hit for monomerid = 50250549
TargetSodium-dependent dopamine transporter(Homo sapiens (Human))
University Of Vienna
Curated by ChEMBL
LigandPNGBDBM50250549(CHEMBL4092312)
Affinity DataIC50:  1.09E+5nM. Assay description: Inhibition of re-uptake of [3H]-dopamine at human DAT expressed in HEK293 cells preincubated for 5 mins followed by [3H]-dopamine addition measured a...
In DepthDetails ArticlePubMed