BDBM50250595 CHEMBL4100037
SMILES OP(O)(=O)C(F)(F)c1ccc(cc1)-c1cccc(Cc2cc(Cl)c(Cl)cc2F)c1
InChI Key InChIKey=ICZUJECBPUEODK-UHFFFAOYSA-N
Data  1 KI
  Tab Delimited (TSV)   2D SDfile   Computed 3D by Vconf -m prep SDfile
Find this compound or compounds like it in BindingDB:
Activity Spreadsheet -- Enzyme Inhibition Constant Data from BindingDB
Found 1 hit for monomerid = 50250595
TargetTyrosine-protein phosphatase non-receptor type 5(Homo sapiens (Human))
Yale University
Curated by ChEMBL
LigandPNGBDBM50250595(CHEMBL4100037)
Affinity DataKi:  5.60E+3nM. Assay description: Inhibition of STEP (unknown origin) using pNPP as substrate preincubated for 5 mins followed by substrate addition measured for 20 mins by spectropho...
In DepthDetails ArticlePubMed