BDBM50252148 CHEMBL516606::N-((S)-1-((S)-3-bromo-4-((S)-pyrrolidin-3-yloxy)benzyl)pyrrolidin-3-yl)-3,4-dichlorobenzamide
SMILES Clc1ccc(cc1Cl)C(=O)N[C@H]1CCN(Cc2ccc(O[C@H]3CCNC3)c(Br)c2)C1
InChI Key InChIKey=QDPMXBCJIXLUQB-IRXDYDNUSA-N
Data  1 KI
  Tab Delimited (TSV)   2D SDfile   Computed 3D by Vconf -m prep SDfile
Find this compound or compounds like it in BindingDB:
Activity Spreadsheet -- Enzyme Inhibition Constant Data from BindingDB
Found 1 hit for monomerid = 50252148
TargetUrotensin-2 receptor(Homo sapiens (Human))
Glaxosmithkline
Curated by ChEMBL
LigandPNGBDBM50252148(CHEMBL516606 | N-((S)-1-((S)-3-bromo-4-((S)-pyrrol...)
Affinity DataKi:  44nM. Assay description: Antagonist activity at human recombinant urotensin 2 receptor expressed in HEK293 cells assessed as inhibition of urotensin 2-induced calcium mobiliz...
In DepthDetails ArticlePubMed