BDBM50252744 CHEMBL492430::Isosorbide-2-benzylcarbamate-5-(p-heptyloxybenzoate)
SMILES CCCCCCc1ccc(cc1)C(=O)O[C@@H]1CO[C@@H]2[C@H](CO[C@H]12)OC(=O)NCc1ccccc1
InChI Key InChIKey=VYFBZKSIVDUXHA-ZFFYZDHPSA-N
Data  1 IC50
  Tab Delimited (TSV)   2D SDfile   Computed 3D by Vconf -m prep SDfile
Find this compound or compounds like it in BindingDB:
Activity Spreadsheet -- Enzyme Inhibition Constant Data from BindingDB
Found 1 hit for monomerid = 50252744
TargetCholinesterase(Homo sapiens (Human))
Trinity College
Curated by ChEMBL
LigandPNGBDBM50252744(CHEMBL492430 | Isosorbide-2-benzylcarbamate-5-(p-h...)
Affinity DataIC50:  2.80E+3nM. Assay description: Inhibition of human plasma BuchE by Ellman's method
In DepthDetails ArticlePubMed