BDBM50252788 CHEMBL523500::Isosorbide-2-(methylcarbamate)-5-benzoate
SMILES CNC(=O)O[C@H]1CO[C@@H]2[C@@H](CO[C@H]12)OC(=O)c1ccccc1
InChI Key InChIKey=XVQSZSYQBPAKTI-YVECIDJPSA-N
Data  1 IC50
  Tab Delimited (TSV)   2D SDfile   Computed 3D by Vconf -m prep SDfile
Find this compound or compounds like it in BindingDB:
Activity Spreadsheet -- Enzyme Inhibition Constant Data from BindingDB
Found 1 hit for monomerid = 50252788
TargetCholinesterase(Homo sapiens (Human))
Trinity College
Curated by ChEMBL
LigandPNGBDBM50252788(CHEMBL523500 | Isosorbide-2-(methylcarbamate)-5-be...)
Affinity DataIC50:  669nM. Assay description: Inhibition of human plasma BuchE by Ellman's method
In DepthDetails ArticlePubMed