BDBM50253228 CHEMBL521852::Isosorbide-2-(cyclohexylcarbamate)-5-mononitrate
SMILES [O-][N+](=O)O[C@@H]1CO[C@@H]2[C@H](CO[C@H]12)OC(=O)NC1CCCCC1
InChI Key InChIKey=HHQBHYZANLCQHI-IRCOFANPSA-N
Data  1 IC50
  Tab Delimited (TSV)   2D SDfile   Computed 3D by Vconf -m prep SDfile
Find this compound or compounds like it in BindingDB:
Activity Spreadsheet -- Enzyme Inhibition Constant Data from BindingDB
Found 1 hit for monomerid = 50253228
TargetCholinesterase(Homo sapiens (Human))
Trinity College
Curated by ChEMBL
LigandPNGBDBM50253228(CHEMBL521852 | Isosorbide-2-(cyclohexylcarbamate)-...)
Affinity DataIC50:  2.50E+3nM. Assay description: Inhibition of human plasma BuchE by Ellman's method
In DepthDetails ArticlePubMed