BDBM50253263 CHEMBL492481::Isosorbide-2-benzylcarbamate-5-isonicotinate
SMILES O=C(NCc1ccccc1)O[C@H]1CO[C@@H]2[C@@H](CO[C@H]12)OC(=O)c1ccncc1
InChI Key InChIKey=CPCJEEMJBNMGOE-XMTFNYHQSA-N
Data  1 IC50
  Tab Delimited (TSV)   2D SDfile   Computed 3D by Vconf -m prep SDfile
Find this compound or compounds like it in BindingDB:
Activity Spreadsheet -- Enzyme Inhibition Constant Data from BindingDB
Found 1 hit for monomerid = 50253263
TargetCholinesterase(Homo sapiens (Human))
Trinity College
Curated by ChEMBL
LigandPNGBDBM50253263(CHEMBL492481 | Isosorbide-2-benzylcarbamate-5-ison...)
Affinity DataIC50:  88nM. Assay description: Inhibition of human plasma BuchE by Ellman's method
In DepthDetails ArticlePubMed