BDBM50253266 (3R,3aR,6S,6aR)-6-(benzylcarbamoyloxy)hexahydrofuro[3,2-b]furan-3-yl biphenyl-4-carboxylate::2-(Benzylaminocarbonyloxy-)-5-(p-biphenylcarbonyloxy-)-1,4:3,6-dianhydro-Dglucitol::CHEMBL523005
SMILES O=C(NCc1ccccc1)O[C@H]1CO[C@@H]2[C@@H](CO[C@H]12)OC(=O)c1ccc(cc1)-c1ccccc1
InChI Key InChIKey=GWAJAKWZRRYDDO-ZFFYZDHPSA-N
Data  3 IC50
  Tab Delimited (TSV)   2D SDfile   Computed 3D by Vconf -m prep SDfile
Find this compound or compounds like it in BindingDB:
Activity Spreadsheet -- Enzyme Inhibition Constant Data from BindingDB
Found 3 hits for monomerid = 50253266
TargetCholinesterase(Homo sapiens (Human))
Trinity College
Curated by ChEMBL
LigandPNGBDBM50253266((3R,3aR,6S,6aR)-6-(benzylcarbamoyloxy)hexahydrofur...)
Affinity DataIC50:  12nM. Assay description: Inhibition of human plasma BuchE by Ellman's method
In DepthDetails ArticlePubMed
TargetCholinesterase(Homo sapiens (Human))
Trinity College
Curated by ChEMBL
LigandPNGBDBM50253266((3R,3aR,6S,6aR)-6-(benzylcarbamoyloxy)hexahydrofur...)
Affinity DataIC50:  12nM. Assay description: Inhibition of BuChE in human liver microsomes
In DepthDetails ArticlePubMed
TargetAcetylcholinesterase(Electrophorus electricus (Electric eel))
Trinity College
Curated by ChEMBL
LigandPNGBDBM50253266((3R,3aR,6S,6aR)-6-(benzylcarbamoyloxy)hexahydrofur...)
Affinity DataIC50:  5.16E+4nM. Assay description: Inhibition of electric eel AchE by Ellman's method
In DepthDetails ArticlePubMed