BDBM50257219 CHEMBL4059541
SMILES CCCC[C@H](NC(=O)[C@@H]1CCCN1C(=O)CNC(=O)[C@H](CCCCN)NC(=O)[C@H](Cc1c[nH]cn1)NC(=O)[C@H](CO)NC(=O)[C@H](CC(C)C)NC(=O)N(CCCNC(N)=N)NC(=O)[C@@H]1CCCN1C(=O)[C@H](CCCNC(N)=N)NC(=O)[C@H](CCC(N)=O)NC(=O)[C@H](CCCNC(N)=N)NC(=O)[C@H](CCCNC(N)=N)NC(=O)[C@H](Cc1ccccc1)NC(=O)[C@@H](N)CCCCN)C(=O)NC(C)(C)C(=O)N[C@@H](Cc1ccc(Br)cc1)C(O)=O
InChI Key InChIKey=LPAURJRUPKHUSF-ZJYHGZGPSA-N
Data  1 KI
  Tab Delimited (TSV)   2D SDfile   Computed 3D by Vconf -m prep SDfile
Find this compound or compounds like it in BindingDB:
Activity Spreadsheet -- Enzyme Inhibition Constant Data from BindingDB
Found 1 hit for monomerid = 50257219
TargetApelin receptor(Rattus norvegicus)
University Of Alberta
Curated by ChEMBL
LigandPNGBDBM50257219(CHEMBL4059541)
Affinity DataKi:  0.140nM. Assay description: Displacement of [125I]-pyr-1-apelin-13 from rat C-terminal EGFP-tagged APJ receptor expressed in CHO cell membranes after 3 hrs by Wallac gamma count...
In DepthDetails ArticlePubMed