BDBM50257221 CHEMBL4059998
SMILES CCCC[C@H](NC(=O)[C@@H]1CCCN1C(=O)CNC(=O)[C@H](CCCCN)NC(=O)[C@H](Cc1c[nH]cn1)NC(=O)[C@H](CO)NC(=O)[C@H](CC(C)C)N(C)C(=O)[C@H](CCCNC(N)=N)NC(=O)[C@@H]1CCCN1C(=O)[C@H](CCCNC(N)=N)NC(=O)[C@@H]1CCC(=O)N1)C(=O)NC(C)(C)C(=O)N[C@@H](Cc1ccc(Br)cc1)C(O)=O
InChI Key InChIKey=HLQNQERXFGPNSD-ZOOWYRFPSA-N
Data  1 KI
  Tab Delimited (TSV)   2D SDfile   Computed 3D by Vconf -m prep SDfile
Find this compound or compounds like it in BindingDB:
Activity Spreadsheet -- Enzyme Inhibition Constant Data from BindingDB
Found 1 hit for monomerid = 50257221
TargetApelin receptor(Rattus norvegicus)
University Of Alberta
Curated by ChEMBL
LigandPNGBDBM50257221(CHEMBL4059998)
Affinity DataKi:  0.100nM. Assay description: Displacement of [125I]-pyr-1-apelin-13 from rat C-terminal EGFP-tagged APJ receptor expressed in CHO cell membranes after 3 hrs by Wallac gamma count...
Ligand InfoKEGGPC cidPC sid
In DepthDetails ArticlePubMed