BDBM50257520 CHEMBL4074421
SMILES O[C@H]1CC[C@@H](CC1)Nc1ccc(cc1Cl)-c1ccn2c(CC3CC3)nnc2c1Cl
InChI Key InChIKey=SOTRPBHTXCSDMF-WKILWMFISA-N
Data  1 KI  1 Kd  1 EC50
  Tab Delimited (TSV)   2D SDfile   Computed 3D by Vconf -m prep SDfile
Find this compound or compounds like it in BindingDB:
Activity Spreadsheet -- Enzyme Inhibition Constant Data from BindingDB
Found 3 hits for monomerid = 50257520
TargetMetabotropic glutamate receptor 2(Homo sapiens (Human))
Leiden University
Curated by ChEMBL
LigandPNGBDBM50257520(CHEMBL4074421)
Affinity DataKi:  3nM. Assay description: Binding affinity to human metabotropic glutamate receptor 2 expressed in CHOK1 cell membranes by scintillation proximity assay
In DepthDetails ArticlePubMed
TargetMetabotropic glutamate receptor 2(Homo sapiens (Human))
Leiden University
Curated by ChEMBL
LigandPNGBDBM50257520(CHEMBL4074421)
Affinity DataKd:  13nM. Assay description: Binding affinity to human metabotropic glutamate receptor 2 expressed in CHOK1 cell membranes by scintillation proximity assay
In DepthDetails ArticlePubMed
TargetMetabotropic glutamate receptor 2(Homo sapiens (Human))
Leiden University
Curated by ChEMBL
LigandPNGBDBM50257520(CHEMBL4074421)
Affinity DataEC50:  33nM. Assay description: Positive allosteric modulation of human metabotropic glutamate receptor 2 expressed in CHOK1 cell membranes assessed as increase in glutamate-induced...
In DepthDetails ArticlePubMed