BDBM50257548 CHEMBL4104081
SMILES O[C@H]1CC[C@@H](CC1)Nc1ccc(cc1Cl)-c1ccn2c(CC3CC3)nnc2c1C(F)(F)F
InChI Key InChIKey=YJJYVESVSULNDF-WKILWMFISA-N
Data  1 KI  1 Kd  1 EC50
  Tab Delimited (TSV)   2D SDfile   Computed 3D by Vconf -m prep SDfile
Find this compound or compounds like it in BindingDB:
Activity Spreadsheet -- Enzyme Inhibition Constant Data from BindingDB
Found 3 hits for monomerid = 50257548
TargetMetabotropic glutamate receptor 2(Homo sapiens (Human))
Leiden University
Curated by ChEMBL
LigandPNGBDBM50257548(CHEMBL4104081)
Affinity DataKi:  2.20nM. Assay description: Binding affinity to human metabotropic glutamate receptor 2 expressed in CHOK1 cell membranes by scintillation proximity assay
In DepthDetails ArticlePubMed
TargetMetabotropic glutamate receptor 2(Homo sapiens (Human))
Leiden University
Curated by ChEMBL
LigandPNGBDBM50257548(CHEMBL4104081)
Affinity DataEC50:  9.30nM. Assay description: Binding affinity to human metabotropic glutamate receptor 2 expressed in CHOK1 cell membranes by scintillation proximity assay
In DepthDetails ArticlePubMed
TargetMetabotropic glutamate receptor 2(Homo sapiens (Human))
Leiden University
Curated by ChEMBL
LigandPNGBDBM50257548(CHEMBL4104081)
Affinity DataKd:  3nM. Assay description: Binding affinity to human metabotropic glutamate receptor 2 expressed in CHOK1 cell membranes by scintillation proximity assay
In DepthDetails ArticlePubMed