BDBM50257736 CHEMBL506273::methyl 2-(4-(2-(3-(2-methyl-1H-benzo[d]imidazol-1-yl)-8-azabicyclo[3.2.1]octan-8-yl)ethyl)-4-phenylpiperidin-1-yl)-2-phenylacetate
SMILES COC(=O)C(N1CCC(CCN2[C@H]3CC[C@@H]2C[C@@H](C3)n2c(C)nc3ccccc23)(CC1)c1ccccc1)c1ccccc1
InChI Key InChIKey=DOKCTIDKDIKECV-REZRWBRJSA-N
Data  1 IC50
  Tab Delimited (TSV)   2D SDfile   Computed 3D by Vconf -m prep SDfile
Find this compound or compounds like it in BindingDB:
Activity Spreadsheet -- Enzyme Inhibition Constant Data from BindingDB
Found 1 hit for monomerid = 50257736
TargetC-C chemokine receptor type 5(Homo sapiens (Human))
Glaxosmithkline
Curated by ChEMBL
LigandPNGBDBM50257736(CHEMBL506273 | methyl 2-(4-(2-(3-(2-methyl-1H-benz...)
Affinity DataIC50:  5nM. Assay description: Displacement of [125I]MIP-1beta from CCR5 (unknown origin) expressed in CHO cell membrane
In DepthDetails ArticlePubMed