BDBM50258789 (S)-2-amino-N-(3-(5-(5-(2-chlorophenyl)-1,3,4-oxadiazol-2-yl)-3-(trifluoromethyl)-1H-pyrazol-1-yl)benzyl)propanamide::CHEMBL468926
SMILES C[C@H](N)C(=O)NCc1cccc(c1)-n1nc(cc1-c1nnc(o1)-c1ccccc1Cl)C(F)(F)F
InChI Key InChIKey=YJJLUDGRBLUWTF-LBPRGKRZSA-N
Data  1 IC50
  Tab Delimited (TSV)   2D SDfile   Computed 3D by Vconf -m prep SDfile
Find this compound or compounds like it in BindingDB:
Activity Spreadsheet -- Enzyme Inhibition Constant Data from BindingDB
Found 1 hit for monomerid = 50258789
TargetHistone-arginine methyltransferase CARM1(Homo sapiens (Human))
Bristol-Myers Squibb Pharmaceutical Research And Development
Curated by ChEMBL
LigandPNGBDBM50258789((S)-2-amino-N-(3-(5-(5-(2-chlorophenyl)-1,3,4-oxad...)
Affinity DataIC50:  50nM. Assay description: Inhibition of CARM1 assessed as blockade of histone H3 methylation
In DepthDetails ArticlePubMed