BDBM50259490 2-Phenyl-4(5)-(4-trifluoromethylphenyl)imidazole::CHEMBL467700
SMILES FC(F)(F)c1ccc(cc1)-c1c[nH]c(n1)-c1ccccc1
InChI Key InChIKey=VHNCWTDEMBCLFE-UHFFFAOYSA-N
Data  1 IC50
  Tab Delimited (TSV)   2D SDfile   Computed 3D by Vconf -m prep SDfile
Find this compound or compounds like it in BindingDB:
Activity Spreadsheet -- Enzyme Inhibition Constant Data from BindingDB
Found 1 hit for monomerid = 50259490
TargetSodium channel protein type 2 subunit alpha(Homo sapiens (Human))
Università
Curated by ChEMBL
LigandPNGBDBM50259490(2-Phenyl-4(5)-(4-trifluoromethylphenyl)imidazole |...)
Affinity DataIC50:  1.40E+3nM. Assay description: Inhibition of human Nav1.2 channel expressed in HEK cells by patch-clamp electrophysiology method
In DepthDetails ArticlePubMed