BDBM50259541 2-(4-Nitrophenyl)-4(5)-(3-trifluoromethylphenyl)-imidazole::CHEMBL468120
SMILES [O-][N+](=O)c1ccc(cc1)-c1nc(c[nH]1)-c1cccc(c1)C(F)(F)F
InChI Key InChIKey=DBWPZPDNRGTIBL-UHFFFAOYSA-N
Data  1 IC50
  Tab Delimited (TSV)   2D SDfile   Computed 3D by Vconf -m prep SDfile
Find this compound or compounds like it in BindingDB:
Activity Spreadsheet -- Enzyme Inhibition Constant Data from BindingDB
Found 1 hit for monomerid = 50259541
TargetSodium channel protein type 2 subunit alpha(Homo sapiens (Human))
Università
Curated by ChEMBL
LigandPNGBDBM50259541(2-(4-Nitrophenyl)-4(5)-(3-trifluoromethylphenyl)-i...)
Affinity DataIC50:  2.50E+3nM. Assay description: Inhibition of human Nav1.2 channel expressed in HEK cells by patch-clamp electrophysiology method
In DepthDetails ArticlePubMed