BDBM50259899 CHEMBL4088291
SMILES COc1ccc(F)c(CC2CCc3c(nc(N)n3C2)C(C)C)c1
InChI Key InChIKey=XJHGXEWMRNPZQE-UHFFFAOYSA-N
Data  2 IC50
PDB links: 1 PDB ID matches this monomer.
  Tab Delimited (TSV)   2D SDfile   Computed 3D by Vconf -m prep SDfile
Find this compound or compounds like it in BindingDB:
Activity Spreadsheet -- Enzyme Inhibition Constant Data from BindingDB
Found 2 hits for monomerid = 50259899
TargetPolycomb protein EED(Homo sapiens (Human))
Novartis Institutes For Biomedical Research
Curated by ChEMBL
LigandPNGBDBM50259899(CHEMBL4088291)
Affinity DataIC50:  2.90E+3nM. Assay description: Inhibition of EED in human G401 cells assessed as reduction in H3K27 methylation measured after 48 hrs by ELISA method
TargetPolycomb protein EED(Homo sapiens (Human))
Novartis Institutes For Biomedical Research
Curated by ChEMBL
LigandPNGBDBM50259899(CHEMBL4088291)
Affinity DataIC50:  1.30E+3nM. Assay description: Inhibition of human PRC2-EED (76 to 441 residues) expressed in Escherichia coli BL21 (DE3) using histone H3[21 to 44, K27MeO] as substrate and SAM as...