BDBM50259904 CHEMBL4082435
SMILES C(C1CCCNC1)c1cccc2ccoc12
InChI Key InChIKey=GPXIHTRIVNXBFR-UHFFFAOYSA-N
Data  1 IC50
  Tab Delimited (TSV)   2D SDfile   Computed 3D by Vconf -m prep SDfile
Find this compound or compounds like it in BindingDB:
Activity Spreadsheet -- Enzyme Inhibition Constant Data from BindingDB
Found 1 hit for monomerid = 50259904
TargetPolycomb protein EED(Homo sapiens (Human))
Novartis Institutes For Biomedical Research
Curated by ChEMBL
LigandPNGBDBM50259904(CHEMBL4082435)
Affinity DataIC50:  9.50E+4nM. Assay description: Inhibition of human PRC2-EED (76 to 441 residues) expressed in Escherichia coli BL21 (DE3) using histone H3[21 to 44, K27MeO] as substrate and SAM as...
In DepthDetails ArticlePubMed