BDBM50260003 CHEMBL4088791
SMILES O[C@@H]1[C@@H](CNC(=O)c2ccccc2Cl)OC[C@@]1(O)CN=[N+]=[N-]
InChI Key InChIKey=NICDEHXMCUCCOW-WZRBSPASSA-N
Data  2 EC50
  Tab Delimited (TSV)   2D SDfile   Computed 3D by Vconf -m prep SDfile
Find this compound or compounds like it in BindingDB:
Activity Spreadsheet -- Enzyme Inhibition Constant Data from BindingDB
Found 2 hits for monomerid = 50260003
TargetSignal transduction protein TRAP(Staphylococcus aureus (strain Mu50 / ATCC 700699))
Ghent University
Curated by ChEMBL
LigandPNGBDBM50260003(CHEMBL4088791)
Affinity DataEC50:  1.51E+4nM. Assay description: Inhibition of methicillin-resistant Staphylococcus aureus Mu50 TRAP assessed as potentiation of vancomycin-induced antibiofilm activity treated for 4...
In DepthDetails ArticlePubMed
TargetSignal transduction protein TRAP(Staphylococcus aureus (strain Mu50 / ATCC 700699))
Ghent University
Curated by ChEMBL
LigandPNGBDBM50260003(CHEMBL4088791)
Affinity DataEC50:  2.34E+3nM. Assay description: Inhibition of methicillin-resistant Staphylococcus aureus Mu50 TRAP assessed as potentiation of vancomycin-induced antibiofilm activity cotreated wit...
In DepthDetails ArticlePubMed