BDBM50260970 (E)-2-(1-hexyl-2-oxoindolin-3-ylidene)acetic acid::CHEMBL498569
SMILES CCCCCCN1C(=O)\C(=C\C(O)=O)c2ccccc12
InChI Key InChIKey=MFYQYWXMOLRKEB-ACCUITESSA-N
Data  1 IC50
  Tab Delimited (TSV)   2D SDfile   Computed 3D by Vconf -m prep SDfile
Find this compound or compounds like it in BindingDB:
Activity Spreadsheet -- Enzyme Inhibition Constant Data from BindingDB
Found 1 hit for monomerid = 50260970
TargetM-phase inducer phosphatase 1(Homo sapiens (Human))
Doshisha Women'S College Of Liberal Arts
Curated by ChEMBL
LigandPNGBDBM50260970((E)-2-(1-hexyl-2-oxoindolin-3-ylidene)acetic acid ...)
Affinity DataIC50: >1.00E+5nM. Assay description: Inhibition of human Cdc25A phosphatase activity
In DepthDetails ArticlePubMed