BDBM50260971 (E)-2-(1-octyl-2-oxoindolin-3-ylidene)acetic acid::CHEMBL527034
SMILES CCCCCCCCN1C(=O)\C(=C\C(O)=O)c2ccccc12
InChI Key InChIKey=PJTCQTYZZMJXMC-FYWRMAATSA-N
Data  1 IC50
  Tab Delimited (TSV)   2D SDfile   Computed 3D by Vconf -m prep SDfile
Find this compound or compounds like it in BindingDB:
Activity Spreadsheet -- Enzyme Inhibition Constant Data from BindingDB
Found 1 hit for monomerid = 50260971
TargetM-phase inducer phosphatase 1(Homo sapiens (Human))
Doshisha Women'S College Of Liberal Arts
Curated by ChEMBL
LigandPNGBDBM50260971((E)-2-(1-octyl-2-oxoindolin-3-ylidene)acetic acid ...)
Affinity DataIC50:  7.80E+4nM. Assay description: Inhibition of human Cdc25A phosphatase activity
In DepthDetails ArticlePubMed