BDBM50261056 (Z)-2-(1-octyl-2-oxoindolin-3-ylidene)acetic acid::CHEMBL508012
SMILES CCCCCCCCN1C(=O)\C(=C/C(O)=O)c2ccccc12
InChI Key InChIKey=PJTCQTYZZMJXMC-SQFISAMPSA-N
Data  1 IC50
  Tab Delimited (TSV)   2D SDfile   Computed 3D by Vconf -m prep SDfile
Find this compound or compounds like it in BindingDB:
Activity Spreadsheet -- Enzyme Inhibition Constant Data from BindingDB
Found 1 hit for monomerid = 50261056
TargetM-phase inducer phosphatase 1(Homo sapiens (Human))
Doshisha Women'S College Of Liberal Arts
Curated by ChEMBL
LigandPNGBDBM50261056((Z)-2-(1-octyl-2-oxoindolin-3-ylidene)acetic acid ...)
Affinity DataIC50:  3.90E+4nM. Assay description: Inhibition of human Cdc25A phosphatase activity
In DepthDetails ArticlePubMed